Target
Far upstream element-binding protein 1
Ligand
BDBM50558623
Substrate
Meas. Tech.
ChEMBL_2064177 (CHEMBL4719430)
IC50
>100000±n/a nM
Citation
 Hauck, SHiesinger, KKhageh Hosseini, SAchenbach, JBiondi, RMProschak, EZörnig, MOdadzic, D Pyrazolo[1,5a]pyrimidines as a new class of FUSE binding protein 1 (FUBP1) inhibitors. Bioorg Med Chem 24:5717-5729 (2016)  
Target
Name:
Far upstream element-binding protein 1
Synonyms:
DNA helicase V FUBP1 FUSE-binding protein 1 hDH V
Type:
PROTEIN
Mol. Mass.:
67565.13
Organism:
Homo sapiens
Description:
ChEMBL_118167
Residue:
644
  
Inhibitor
Name:
BDBM50558623
Synonyms:
CHEMBL4790064
Type:
Small organic molecule
Emp. Form.:
C17H10F3N3S
Mol. Mass.:
345.342
SMILES:
FC(F)(F)c1cc(nc2cc(nn12)-c1cccs1)-c1ccccc1
: