Target
Mu-type opioid receptor
Ligand
BDBM50120876
Substrate
Meas. Tech.
ChEMBL_148383 (CHEMBL757378)
IC50
32.9±n/a nM
Citation
 Ogawa, TMiyamae, TMurayama, KOkuyama, KOkayama, THagiwara, MSakurada, SMorikawa, T Synthesis and structure-activity relationships of an orally available and long-acting analgesic peptide, N(alpha)-amidino-Tyr-D-Arg-Phe-MebetaAla-OH (ADAMB). J Med Chem 45:5081-9 (2002)  
Target
Name:
Mu-type opioid receptor
Synonyms:
M-OR-1 Mor OPRM_MOUSE Oprm | Oprm1
Type:
Enzyme Catalytic Domain
Mol. Mass.:
44431.62
Organism:
MOUSE
Description:
OPIATE Mu OPRM1 MOUSE::P42866
Residue:
398
  
Inhibitor
Name:
BDBM50120876
Synonyms:
6-Amino-2-[(2-{5-guanidino-2-[2-guanidino-3-(3-hydroxy-phenyl)-propionylamino]-pentanoylamino}-3-phenyl-propionyl)-methyl-amino]-hexanoic acid | CHEMBL150121
Type:
Small organic molecule
Emp. Form.:
C32H48N10O6
Mol. Mass.:
668.7869
SMILES:
[#6]-[#7](-[#6@@H](-[#6]-[#6]-[#6]-[#6]-[#7])-[#6](-[#8])=O)-[#6](=O)-[#6@H](-[#6]-c1ccccc1)-[#7]-[#6](=O)-[#6@H](-[#6]-[#6]-[#6]-[#7]-[#6](-[#7])=[#7])-[#7]-[#6](=O)-[#6@H](-[#6]-c1cccc(-[#8])c1)\[#7]=[#6](/[#7])-[#7]
: