Target
Mu-type opioid receptor
Ligand
BDBM50120879
Substrate
Meas. Tech.
ChEMBL_148383 (CHEMBL757378)
IC50
101±n/a nM
Citation
 Ogawa, TMiyamae, TMurayama, KOkuyama, KOkayama, THagiwara, MSakurada, SMorikawa, T Synthesis and structure-activity relationships of an orally available and long-acting analgesic peptide, N(alpha)-amidino-Tyr-D-Arg-Phe-MebetaAla-OH (ADAMB). J Med Chem 45:5081-9 (2002)  
Target
Name:
Mu-type opioid receptor
Synonyms:
M-OR-1 Mor OPRM_MOUSE Oprm | Oprm1
Type:
Enzyme Catalytic Domain
Mol. Mass.:
44431.62
Organism:
MOUSE
Description:
OPIATE Mu OPRM1 MOUSE::P42866
Residue:
398
  
Inhibitor
Name:
BDBM50120879
Synonyms:
2-[(2-{2-[2-Dimethylamino-3-(3-hydroxy-phenyl)-propionylamino]-5-guanidino-pentanoylamino}-3-phenyl-propionyl)-methyl-amino]-propionic acid | CHEMBL147539
Type:
Small organic molecule
Emp. Form.:
C30H43N7O6
Mol. Mass.:
597.7057
SMILES:
C[C@H](N(C)C(=O)[C@H](Cc1ccccc1)NC(=O)[C@H](CCCNC(N)=N)NC(=O)[C@H](Cc1cccc(O)c1)N(C)C)C(O)=O
: