Target
Mu-type opioid receptor
Ligand
BDBM50120874
Substrate
Meas. Tech.
ChEMBL_148383 (CHEMBL757378)
IC50
>1000±n/a nM
Citation
 Ogawa, TMiyamae, TMurayama, KOkuyama, KOkayama, THagiwara, MSakurada, SMorikawa, T Synthesis and structure-activity relationships of an orally available and long-acting analgesic peptide, N(alpha)-amidino-Tyr-D-Arg-Phe-MebetaAla-OH (ADAMB). J Med Chem 45:5081-9 (2002)  
Target
Name:
Mu-type opioid receptor
Synonyms:
M-OR-1 Mor OPRM_MOUSE Oprm | Oprm1
Type:
Enzyme Catalytic Domain
Mol. Mass.:
44431.62
Organism:
MOUSE
Description:
OPIATE Mu OPRM1 MOUSE::P42866
Residue:
398
  
Inhibitor
Name:
BDBM50120874
Synonyms:
2-(2-{5-Guanidino-2-[3-(3-hydroxy-phenyl)-2-methoxyamino-propionylamino]-pentanoylamino}-3-phenyl-propionylamino)-propionic acid | CHEMBL344108
Type:
Small organic molecule
Emp. Form.:
C28H39N7O7
Mol. Mass.:
585.652
SMILES:
CON[C@@H](Cc1cccc(O)c1)C(=O)N[C@@H](CCCNC(N)=N)C(=O)N[C@@H](Cc1ccccc1)C(=O)N[C@@H](C)C(O)=O
: