Target
Dual specificity protein kinase CLK4
Ligand
BDBM50434353
Substrate
Meas. Tech.
ChEMBL_2064266 (CHEMBL4719519)
IC50
59±n/a nM
Citation
 Chaikuad, ADiharce, JSchröder, MFoucourt, ALeblond, BCasagrande, ASDésiré, LBonnet, PKnapp, SBesson, T An Unusual Binding Model of the Methyl 9-Anilinothiazolo[5,4-f] quinazoline-2-carbimidates (EHT 1610 and EHT 5372) Confers High Selectivity for Dual-Specificity Tyrosine Phosphorylation-Regulated Kinases. J Med Chem 59:10315-10321 (2016)  
Target
Name:
Dual specificity protein kinase CLK4
Synonyms:
CDC-like kinase 4 CLK4_HUMAN | Dual specificity protein kinase CLK1/CLK4
Type:
Serine/threonine-protein kinase
Mol. Mass.:
57522.53
Organism:
Homo sapiens (Human)
Description:
gi_10190706
Residue:
481
  
Inhibitor
Name:
BDBM50434353
Synonyms:
CHEMBL2386747 | US9446044, 72
Type:
Small organic molecule
Emp. Form.:
C17H11Cl2N5OS
Mol. Mass.:
404.273
SMILES:
COC(=N)c1nc2ccc3ncnc(Nc4ccc(Cl)cc4Cl)c3c2s1
: