Target
Bcl-2-related protein A1
Ligand
BDBM50558855
Substrate
Meas. Tech.
ChEMBL_2065940 (CHEMBL4721193)
IC50
55±n/a nM
Citation
 D de Araujo, ALim, JWu, KCXiang, YGood, ACSkerlj, RFairlie, DP Bicyclic Helical Peptides as Dual Inhibitors Selective for Bcl2A1 and Mcl-1 Proteins. J Med Chem 61:2962-2972 (2018)  
Target
Name:
Bcl-2-related protein A1
Synonyms:
B2LA1_HUMAN BCL2L5 Bcl-2-like protein 5 HBPA1 Protein BFL-1 | Protein GRS
Type:
Apoptosis regulator protein
Mol. Mass.:
20130.01
Organism:
Homo sapiens (Human)
Description:
Residue:
175
  
Inhibitor
Name:
BDBM50558855
Synonyms:
CHEMBL4740212
Type:
Small organic molecule
Emp. Form.:
C80H128N20O21
Mol. Mass.:
1705.9937
SMILES:
[H][C@]1(NC(=O)[C@](C)(CCC\C=C\CCC[C@](C)(NC(=O)[C@H](CC(O)=O)NC(=O)CNC1=O)C(=O)N[C@@H](Cc1ccccc1)C(N)=O)NC(=O)[C@H](CCCNC(N)=N)NC(=O)[C@H](CC(C)C)NC(=O)[C@H](CCC(O)=O)NC(=O)[C@H](CCC(N)=O)NC(=O)[C@H](C)NC(=O)[C@@H](NC(=O)C(CNC(=O)C=C)NC(=O)[C@@H](NC(C)=O)[C@@H](C)CC)[C@@H](C)CC)[C@@H](C)CC
: