Target
Estrogen receptor
Ligand
BDBM50023749
Substrate
Meas. Tech.
ChEMBL_65908 (CHEMBL679352)
IC50
150±n/a nM
Citation
 Lubczyk, VBachmann, HGust, R Investigations on estrogen receptor binding. The estrogenic, antiestrogenic, and cytotoxic properties of C2-alkyl-substituted 1,1-bis(4-hydroxyphenyl)-2-phenylethenes. J Med Chem 45:5358-64 (2002)  
Target
Name:
Estrogen receptor
Synonyms:
ER ESR ESR1_HUMAN Estrogen receptor Estrogen receptor (ER-alpha) Estrogen receptor alpha (ER) Nuclear receptor subfamily 3 group A member 1
Type:
Protein
Mol. Mass.:
66230.44
Organism:
Homo sapiens (Human)
Description:
P03372
Residue:
595
  
Inhibitor
Name:
BDBM50023749
Synonyms:
4-(1,2-diphenyl-vinyl)-phenol CHEMBL415864
Type:
Small organic molecule
Emp. Form.:
C20H16O2
Mol. Mass.:
288.3398
SMILES:
[#8]-c1ccc(cc1)-[#6](=[#6]\c1ccccc1)\c1ccc(-[#8])cc1
: