Target
Reverse transcriptase/RNaseH
Ligand
BDBM50121351
Substrate
Meas. Tech.
ChEMBL_195204 (CHEMBL798996)
IC50
56600±n/a nM
Citation
 Barreca, MLBalzarini, JChimirri, ADe Clercq, EDe Luca, LHöltje, HDHöltje, MMonforte, AMMonforte, PPannecouque, CRao, AZappalà, M Design, synthesis, structure-activity relationships, and molecular modeling studies of 2,3-diaryl-1,3-thiazolidin-4-ones as potent anti-HIV agents. J Med Chem 45:5410-3 (2002)  
Target
Name:
Reverse transcriptase/RNaseH
Synonyms:
HIV-1 Reverse Transcriptase RNase H Reverse transcriptase/RNaseH
Type:
PROTEIN
Mol. Mass.:
65229.15
Organism:
Human immunodeficiency virus 1
Description:
ChEMBL_1473730
Residue:
566
  
Inhibitor
Name:
BDBM50121351
Synonyms:
3-(5-Bromo-pyridin-2-yl)-2-(2,6-dichloro-phenyl)-thiazolidin-4-one 3-(5-bromopyridin-2-yl)-2-(2,6-dichlorophenyl)thiazolidin-4-one | CHEMBL357261
Type:
Small organic molecule
Emp. Form.:
C14H9BrCl2N2OS
Mol. Mass.:
404.109
SMILES:
Clc1cccc(Cl)c1C1SCC(=O)N1c1ccc(Br)cn1
: