Target
Reverse transcriptase/RNaseH
Ligand
BDBM50121350
Substrate
Meas. Tech.
ChEMBL_195204 (CHEMBL798996)
IC50
4120±n/a nM
Citation
 Barreca, MLBalzarini, JChimirri, ADe Clercq, EDe Luca, LHöltje, HDHöltje, MMonforte, AMMonforte, PPannecouque, CRao, AZappalà, M Design, synthesis, structure-activity relationships, and molecular modeling studies of 2,3-diaryl-1,3-thiazolidin-4-ones as potent anti-HIV agents. J Med Chem 45:5410-3 (2002)  
Target
Name:
Reverse transcriptase/RNaseH
Synonyms:
HIV-1 Reverse Transcriptase RNase H Reverse transcriptase/RNaseH
Type:
PROTEIN
Mol. Mass.:
65229.15
Organism:
Human immunodeficiency virus 1
Description:
ChEMBL_1473730
Residue:
566
  
Inhibitor
Name:
BDBM50121350
Synonyms:
2-(2-Chloro-6-fluoro-phenyl)-3-(4-methyl-pyridin-2-yl)-thiazolidin-4-one 2-(2-chloro-6-fluorophenyl)-3-(4-methylpyridin-2-yl)thiazolidin-4-one | CHEMBL151152
Type:
Small organic molecule
Emp. Form.:
C15H12ClFN2OS
Mol. Mass.:
322.785
SMILES:
Cc1ccnc(c1)N1C(SCC1=O)c1c(F)cccc1Cl
: