Target
Reverse transcriptase/RNaseH
Ligand
BDBM50121356
Substrate
Meas. Tech.
ChEMBL_195204 (CHEMBL798996)
IC50
61400±n/a nM
Citation
 Barreca, MLBalzarini, JChimirri, ADe Clercq, EDe Luca, LHöltje, HDHöltje, MMonforte, AMMonforte, PPannecouque, CRao, AZappalà, M Design, synthesis, structure-activity relationships, and molecular modeling studies of 2,3-diaryl-1,3-thiazolidin-4-ones as potent anti-HIV agents. J Med Chem 45:5410-3 (2002)  
Target
Name:
Reverse transcriptase/RNaseH
Synonyms:
HIV-1 Reverse Transcriptase RNase H Reverse transcriptase/RNaseH
Type:
PROTEIN
Mol. Mass.:
65229.15
Organism:
Human immunodeficiency virus 1
Description:
ChEMBL_1473730
Residue:
566
  
Inhibitor
Name:
BDBM50121356
Synonyms:
3-(5-Bromo-pyridin-2-yl)-2-(2,6-difluoro-phenyl)-thiazolidin-4-one CHEMBL357713
Type:
Small organic molecule
Emp. Form.:
C14H9BrF2N2OS
Mol. Mass.:
371.2
SMILES:
Fc1cccc(F)c1C1SCC(=O)N1c1ccc(Br)cn1
: