Target
Epidermal growth factor receptor
Ligand
BDBM50559062
Substrate
Meas. Tech.
ChEMBL_2067577 (CHEMBL4722830)
IC50
40±n/a nM
Citation
 Lei, HFan, SZhang, HLiu, YJHei, YYZhang, JJZheng, AQXin, MZhang, SQ Discovery of novel 9-heterocyclyl substituted 9H-purines as L858R/T790M/C797S mutant EGFR tyrosine kinase inhibitors. Eur J Med Chem 186:0 (2020)  
Target
Name:
Epidermal growth factor receptor
Synonyms:
EGF Receptor Substrate EGFR_HUMAN ERBB1 Epidermal Growth Factor Receptor erbB-1 Epidermal growth factor receptor (EGFR) HER1 Proto-oncogene c-ErbB-1 Tyrosine-Protein Kinase ErbB-1
Type:
Receptor Kinase Domain
Mol. Mass.:
134279.59
Organism:
Homo sapiens (Human)
Description:
P00533
Residue:
1210
  
Inhibitor
Name:
BDBM50559062
Synonyms:
CHEMBL4795878
Type:
Small organic molecule
Emp. Form.:
C29H35N9O2S
Mol. Mass.:
573.712
SMILES:
CN1CCN(CC1)c1ccc(Nc2ncc3nc(Nc4ccccc4)n([C@H]4CCN(C4)S(=O)(=O)C4CC4)c3n2)cc1
: