Target
Peroxisome proliferator-activated receptor gamma
Ligand
BDBM50121420
Substrate
Meas. Tech.
ChEMBL_154362 (CHEMBL756624)
Ki
170±n/a nM
Citation
 Thor, MBeierlein, KDykes, GGustavsson, ALHeidrich, JJendeberg, LLindqvist, BPegurier, CRoussel, PSlater, MSvensson, SSydow-Bäckman, MThornström, UUppenberg, J Synthesis and pharmacological evaluation of a new class of peroxisome proliferator-activated receptor modulators. Bioorg Med Chem Lett 12:3565-7 (2002)  
Target
Name:
Peroxisome proliferator-activated receptor gamma
Synonyms:
NR1C3 PPAR-gamma PPARG_HUMAN Peroxisome proliferator-activated receptor gamma (PPAR gamma) Peroxisome proliferator-activated receptor gamma (PPARĪ³) peroxisome proliferator-activated receptor gamma isoform 2
Type:
Nuclear Receptor
Mol. Mass.:
57613.46
Organism:
Homo sapiens (Human)
Description:
P37231
Residue:
505
  
Inhibitor
Name:
BDBM50121420
Synonyms:
CHEMBL330938 | Lithium; 2-(2,4-dichloro-benzoylamino)-5-(3-nitro-pyridin-2-yloxy)-benzoate
Type:
Small organic molecule
Emp. Form.:
C19H10Cl2N3O6
Mol. Mass.:
447.206
SMILES:
[O-]C(=O)c1cc(Oc2ncccc2[N+]([O-])=O)ccc1NC(=O)c1ccc(Cl)cc1Cl
: