Target
Peroxisome proliferator-activated receptor alpha
Ligand
BDBM50121420
Substrate
Meas. Tech.
ChEMBL_42430 (CHEMBL659180)
EC50
>100000±n/a nM
Citation
 Thor, MBeierlein, KDykes, GGustavsson, ALHeidrich, JJendeberg, LLindqvist, BPegurier, CRoussel, PSlater, MSvensson, SSydow-Bäckman, MThornström, UUppenberg, J Synthesis and pharmacological evaluation of a new class of peroxisome proliferator-activated receptor modulators. Bioorg Med Chem Lett 12:3565-7 (2002)  
Target
Name:
Peroxisome proliferator-activated receptor alpha
Synonyms:
NR1C1 PPAR PPAR-alpha PPARA_HUMAN Peroxisome proliferator-activated receptor | Peroxisome proliferator-activated receptor alpha (PPAR alpha)
Type:
Enzyme
Mol. Mass.:
52222.08
Organism:
Homo sapiens (Human)
Description:
Q07869
Residue:
468
  
Inhibitor
Name:
BDBM50121420
Synonyms:
CHEMBL330938 | Lithium; 2-(2,4-dichloro-benzoylamino)-5-(3-nitro-pyridin-2-yloxy)-benzoate
Type:
Small organic molecule
Emp. Form.:
C19H10Cl2N3O6
Mol. Mass.:
447.206
SMILES:
[O-]C(=O)c1cc(Oc2ncccc2[N+]([O-])=O)ccc1NC(=O)c1ccc(Cl)cc1Cl
: