Target
Amine oxidase [flavin-containing] B
Ligand
BDBM50121685
Substrate
Meas. Tech.
ChEMBL_123596 (CHEMBL734178)
IC50
0.318000±n/a nM
Citation
 Ooms, FFrédérick, RDurant, FPetzer, JPCastagnoli, NVan der Schyf, CJWouters, J Rational approaches towards reversible inhibition of type B monoamine oxidase. Design and evaluation of a novel 5H-Indeno[1,2-c]pyridazin-5-one derivative. Bioorg Med Chem Lett 13:69-73 (2002)  
Target
Name:
Amine oxidase [flavin-containing] B
Synonyms:
AOFB_HUMAN MAOB Monoamine oxidase type B (MAO B) Monoamine oxidase type B (MAOB)
Type:
Protein
Mol. Mass.:
58768.76
Organism:
Homo sapiens (Human)
Description:
P27338
Residue:
520
  
Inhibitor
Name:
BDBM50121685
Synonyms:
5-(4,4,4-Trifluoro-butoxy)-indan-1-one | CHEMBL414637
Type:
Small organic molecule
Emp. Form.:
C13H13F3O2
Mol. Mass.:
258.2363
SMILES:
FC(F)(F)CCCOc1ccc2C(=O)CCc2c1
: