Target
Puromycin-sensitive aminopeptidase
Ligand
BDBM50121709
Substrate
Meas. Tech.
ChEBML_160080
IC50
3800±n/a nM
Citation
 Kakuta, HKoiso, YNagasawa, KHashimoto, Y Fluorescent bioprobes for visualization of puromycin-sensitive aminopeptidase in living cells. Bioorg Med Chem Lett 13:83-6 (2002)  
Target
Name:
Puromycin-sensitive aminopeptidase
Synonyms:
Aminopeptidase PSA | PSA_HUMAN
Type:
PROTEIN
Mol. Mass.:
103262.98
Organism:
Homo sapiens (Human)
Description:
ChEMBL_160080
Residue:
919
  
Inhibitor
Name:
BDBM50121709
Synonyms:
CHEMBL169458 | PAQ-22
Type:
Small organic molecule
Emp. Form.:
C18H18N2O2
Mol. Mass.:
294.3477
SMILES:
CCc1cccc(CC)c1-n1c(=O)[nH]c2ccccc2c1=O
: