Target
Puromycin-sensitive aminopeptidase
Ligand
BDBM50121711
Substrate
Meas. Tech.
ChEBML_160080
IC50
4600±n/a nM
Citation
 Kakuta, HKoiso, YNagasawa, KHashimoto, Y Fluorescent bioprobes for visualization of puromycin-sensitive aminopeptidase in living cells. Bioorg Med Chem Lett 13:83-6 (2002)  
Target
Name:
Puromycin-sensitive aminopeptidase
Synonyms:
Aminopeptidase PSA | PSA_HUMAN
Type:
PROTEIN
Mol. Mass.:
103262.98
Organism:
Homo sapiens (Human)
Description:
ChEMBL_160080
Residue:
919
  
Inhibitor
Name:
BDBM50121711
Synonyms:
CHEMBL169895 | DAMPAQ
Type:
Small organic molecule
Emp. Form.:
C31H32N4O4S
Mol. Mass.:
556.675
SMILES:
CCc1cc(NS(=O)(=O)c2ccc3c(cccc3c2)N(C)C)cc(CC)c1-n1c(=O)n(C)c2ccccc2c1=O
: