Target
Beta-secretase 2
Ligand
BDBM50559903
Substrate
Meas. Tech.
ChEMBL_2070611 (CHEMBL4726145)
IC50
1.000000±n/a nM
Citation
 Frohn, MLiu, LSiegmund, ACQian, WAmegadzie, AChen, NTan, HHickman, DWood, SWen, PHBartberger, MDWhittington, DAAllen, JRBourbeau, MP The development of a structurally distinct series of BACE1 inhibitors via the (Z)-fluoro-olefin amide bioisosteric replacement. Bioorg Med Chem Lett 30:0 (2020)  
Target
Name:
Beta-secretase 2
Synonyms:
AEPLC ASP1 Asp 1 Aspartyl protease 1 BACE2_HUMAN Beta-secretase (BACE) Beta-secretase 2 (BACE-2) Beta-site APP-cleaving enzyme 2 Memapsin-1 beta-Secretase (BACE-2)
Type:
Protein
Mol. Mass.:
56171.20
Organism:
Homo sapiens (Human)
Description:
Q9Y5Z0
Residue:
518
  
Inhibitor
Name:
BDBM50559903
Synonyms:
CHEMBL4760131
Type:
Small organic molecule
Emp. Form.:
C20H19ClF2N4O2S
Mol. Mass.:
452.905
SMILES:
[H][C@@]12C[C@]1(COC)SC(N)=N[C@]2(CF)c1cc(NC(=O)c2ccc(Cl)cn2)ccc1F
: