Target
Metallo-beta-lactamase GIM-1
Ligand
BDBM50560030
Substrate
Meas. Tech.
ChEMBL_2071127 (CHEMBL4726661)
IC50
227000±n/a nM
Citation
 Muhammad, ZSkagseth, SBoomgaren, MAkhter, SFröhlich, CIsmael, AChristopeit, TBayer, ALeiros, HS Structural studies of triazole inhibitors with promising inhibitor effects against antibiotic resistance metallo-?-lactamases. Bioorg Med Chem 28:0 (2020)  
Target
Name:
Metallo-beta-lactamase GIM-1
Synonyms:
GIM-1 Metallo-beta-lactamase GIM-1
Type:
Enzyme Catalytic Domain
Mol. Mass.:
27418.35
Organism:
Pseudomonas aeruginosa
Description:
Residue:
250
  
Inhibitor
Name:
BDBM50560030
Synonyms:
CHEMBL4760439
Type:
Small organic molecule
Emp. Form.:
C18H19IN4O3S2
Mol. Mass.:
530.403
SMILES:
COc1ccc(CSCc2nn[nH]c2CNS(=O)(=O)c2ccc(I)cc2)cc1
: