Target
Metallo-beta-lactamase GIM-1
Ligand
BDBM50560032
Substrate
Meas. Tech.
ChEMBL_2071127 (CHEMBL4726661)
IC50
193000±n/a nM
Citation
 Muhammad, ZSkagseth, SBoomgaren, MAkhter, SFröhlich, CIsmael, AChristopeit, TBayer, ALeiros, HS Structural studies of triazole inhibitors with promising inhibitor effects against antibiotic resistance metallo-?-lactamases. Bioorg Med Chem 28:0 (2020)  
Target
Name:
Metallo-beta-lactamase GIM-1
Synonyms:
GIM-1 Metallo-beta-lactamase GIM-1
Type:
Enzyme Catalytic Domain
Mol. Mass.:
27418.35
Organism:
Pseudomonas aeruginosa
Description:
Residue:
250
  
Inhibitor
Name:
BDBM50560032
Synonyms:
CHEMBL4748654
Type:
Small organic molecule
Emp. Form.:
C13H17IN4O3S
Mol. Mass.:
436.269
SMILES:
CC(C)OCc1nn[nH]c1CNS(=O)(=O)c1ccc(I)cc1
: