Target
Amyloid-beta precursor protein
Ligand
BDBM50122782
Substrate
Meas. Tech.
ChEMBL_35791 (CHEMBL649398)
Ki
>1000±n/a nM
Citation
 Zhuang, ZPKung, MPWilson, ALee, CWPlössl, KHou, CHoltzman, DMKung, HF Structure-activity relationship of imidazo[1,2-a]pyridines as ligands for detecting beta-amyloid plaques in the brain. J Med Chem 46:237-43 (2003)  
Target
Name:
Amyloid-beta precursor protein
Synonyms:
A4 ABPP AICD-50 AICD-59 AID(57) APP Alzheimer disease amyloid protein Amyloid beta Protein Amyloid beta protein Abeta(1-42) Amyloid intracellular domain 57 Amyloid protein (Abeta42b) Beta amyloid A4 protein Beta-APP42 Beta-amyloid protein 42 C83 CVAP Gamma Secretase Gamma-CTF(57) Gamma-secretase Gamma-secretase C-terminal fragment 57 P3(40) PN-II Protease nexin-II S-APP-beta Soluble APP-beta | beta-Amyloid Precursor Protein (APP)
Type:
Single-pass type I membrane protein
Mol. Mass.:
86890.41
Organism:
Homo sapiens (Human)
Description:
P05067
Residue:
770
  
Inhibitor
Name:
BDBM50122782
Synonyms:
(4-Imidazo[1,2-a]pyridin-2-yl-phenyl)-methyl-amine | CHEMBL81685
Type:
Small organic molecule
Emp. Form.:
C14H13N3
Mol. Mass.:
223.2731
SMILES:
CNc1ccc(cc1)-c1cn2ccccc2n1
: