Target
Amyloid-beta precursor protein
Ligand
BDBM50122788
Substrate
Meas. Tech.
ChEMBL_35791 (CHEMBL649398)
Ki
638±n/a nM
Citation
 Zhuang, ZPKung, MPWilson, ALee, CWPlössl, KHou, CHoltzman, DMKung, HF Structure-activity relationship of imidazo[1,2-a]pyridines as ligands for detecting beta-amyloid plaques in the brain. J Med Chem 46:237-43 (2003)  
Target
Name:
Amyloid-beta precursor protein
Synonyms:
A4 ABPP AICD-50 AICD-59 AID(57) APP Alzheimer disease amyloid protein Amyloid beta Protein Amyloid beta protein Abeta(1-42) Amyloid intracellular domain 57 Amyloid protein (Abeta42b) Beta amyloid A4 protein Beta-APP42 Beta-amyloid protein 42 C83 CVAP Gamma Secretase Gamma-CTF(57) Gamma-secretase Gamma-secretase C-terminal fragment 57 P3(40) PN-II Protease nexin-II S-APP-beta Soluble APP-beta | beta-Amyloid Precursor Protein (APP)
Type:
Single-pass type I membrane protein
Mol. Mass.:
86890.41
Organism:
Homo sapiens (Human)
Description:
P05067
Residue:
770
  
Inhibitor
Name:
BDBM50122788
Synonyms:
2-(4-Bromo-phenyl)-6-methyl-imidazo[1,2-a]pyridine | CHEMBL78765
Type:
Small organic molecule
Emp. Form.:
C14H11BrN2
Mol. Mass.:
287.155
SMILES:
Cc1ccc2nc(cn2c1)-c1ccc(Br)cc1
: