Target
Ubiquitin carboxyl-terminal hydrolase 47
Ligand
BDBM50560588
Substrate
Meas. Tech.
ChEMBL_2072555 (CHEMBL4728089)
IC50
>100000±n/a nM
Citation
 Engström, OBelda, OKullman-Magnusson, MRapp, MBöhm, KPaul, RHenderson, IDerbyshire, DKarlström, SParkes, KEBZhao, H Discovery of USP7 small-molecule allosteric inhibitors. Bioorg Med Chem Lett 30:0 (2020)  
Target
Name:
Ubiquitin carboxyl-terminal hydrolase 47
Synonyms:
Deubiquitinating enzyme 47 USP47 Ubiquitin-specific-processing protease 47
Type:
PROTEIN
Mol. Mass.:
157255.08
Organism:
Homo sapiens (Human)
Description:
ChEMBL_855560
Residue:
1375
  
Inhibitor
Name:
BDBM50560588
Synonyms:
CHEMBL4761706
Type:
Small organic molecule
Emp. Form.:
C14H10F3N3O
Mol. Mass.:
293.2439
SMILES:
Nc1nc2cc(ccn2c1-c1ccc(O)cc1)C(F)(F)F
: