Target
Platelet-derived growth factor receptor beta
Ligand
BDBM50560816
Substrate
Meas. Tech.
ChEMBL_2073402 (CHEMBL4728936)
Kd
5.6±n/a nM
Citation
 Czako, BMarszalek, JRBurke, JPMandal, PLeonard, PGCross, JBMseeh, FJiang, YChang, EQSuzuki, EKovacs, JJFeng, NGera, SHarris, ALLiu, ZMullinax, RAPang, JParker, CASpencer, NDYu, SSWu, QTremblay, MRMikule, KWilcoxen, KHeffernan, TPDraetta, GFJones, P Discovery of IACS-9439, a Potent, Exquisitely Selective, and Orally Bioavailable Inhibitor of CSF1R. J Med Chem 63:9888-9911 (2020)  
Target
Name:
Platelet-derived growth factor receptor beta
Synonyms:
Beta-type platelet-derived growth factor receptor CD140b antigen PDGF Receptor Substrate PDGFR PDGFR-1 PDGFRB PGFRB_HUMAN Platelet-derived growth factor receptor 1 Platelet-derived growth factor receptor beta (PDGFR-beta) Platelet-derived growth factor receptor beta (PDGFRbeta) | VHL/PDGFRB
Type:
Enzyme
Mol. Mass.:
123922.25
Organism:
Homo sapiens (Human)
Description:
P09619
Residue:
1106
  
Inhibitor
Name:
BDBM50560816
Synonyms:
CHEMBL4756510
Type:
Small organic molecule
Emp. Form.:
C19H21ClN4O2S
Mol. Mass.:
404.914
SMILES:
Nc1nccc(COc2ccc3nc(N[C@@H]4CCCC[C@@H]4O)sc3c2)c1Cl
: