Target
Arginase-2, mitochondrial
Ligand
BDBM50008099
Substrate
Meas. Tech.
ChEMBL_2074194 (CHEMBL4729728)
Ki
51±n/a nM
Citation
 Borek, BGajda, TGolebiowski, ABlaszczyk, R Boronic acid-based arginase inhibitors in cancer immunotherapy. Bioorg Med Chem 28:0 (2020)  
Target
Name:
Arginase-2, mitochondrial
Synonyms:
ARG2 Arginase II Non-hepatic arginase | Type II arginase
Type:
PROTEIN
Mol. Mass.:
38576.93
Organism:
Homo sapiens (Human)
Description:
ChEMBL_978892
Residue:
354
  
Inhibitor
Name:
BDBM50008099
Synonyms:
CHEMBL1234777
Type:
Small organic molecule
Emp. Form.:
C5H12N4O3
Mol. Mass.:
176.1738
SMILES:
N[C@@H](CCNC(=N)NO)C(O)=O
: