Target
Arginase-1
Ligand
BDBM50561037
Substrate
Meas. Tech.
ChEMBL_2074195 (CHEMBL4729729)
IC50
8.0±n/a nM
Citation
 Borek, BGajda, TGolebiowski, ABlaszczyk, R Boronic acid-based arginase inhibitors in cancer immunotherapy. Bioorg Med Chem 28:0 (2020)  
Target
Name:
Arginase-1
Synonyms:
ARG1 Liver-type arginase | Type I arginase
Type:
PROTEIN
Mol. Mass.:
34737.53
Organism:
Homo sapiens (Human)
Description:
ChEMBL_978893
Residue:
322
  
Inhibitor
Name:
BDBM50561037
Synonyms:
CHEMBL4762611
Type:
Small organic molecule
Emp. Form.:
C8H17BN2O4
Mol. Mass.:
216.043
SMILES:
NC[C@@]1(CCCB(O)O)CN[C@@H]1C(O)=O
: