Target
D(2) dopamine receptor
Ligand
BDBM152525
Substrate
Meas. Tech.
ChEMBL_2074244 (CHEMBL4729778)
Ki
498±n/a nM
Citation
 Huang, LGao, LZhang, XYin, LHu, JSong, TChen, Y Synthesis and pharmacological evaluation of piperidine (piperazine)-amide substituted derivatives as multi-target antipsychotics. Bioorg Med Chem Lett 30:0 (2020)  
Target
Name:
D(2) dopamine receptor
Synonyms:
D(2) dopamine receptor DOPAMINE D2 Long DRD2 Dopamine D2 receptor Dopamine D2 receptor (D2R) Dopamine2-like | d2
Type:
Cell-surface receptors
Mol. Mass.:
50647.10
Organism:
Homo sapiens (Human)
Description:
P14416
Residue:
443
  
Inhibitor
Name:
BDBM152525
Synonyms:
N-(4-(3-(4-(pyrimidin-2-yl)piperazin-1-yl)propoxy)phenyl)acetamide (2g)
Type:
Small organic molecule
Emp. Form.:
C19H25N5O2
Mol. Mass.:
355.4341
SMILES:
CC(=O)Nc1ccc(OCCCN2CCN(CC2)c2ncccn2)cc1
: