Target
D(2) dopamine receptor
Ligand
BDBM50561093
Substrate
Meas. Tech.
ChEMBL_2074244 (CHEMBL4729778)
Ki
2.1±n/a nM
Citation
 Huang, LGao, LZhang, XYin, LHu, JSong, TChen, Y Synthesis and pharmacological evaluation of piperidine (piperazine)-amide substituted derivatives as multi-target antipsychotics. Bioorg Med Chem Lett 30:0 (2020)  
Target
Name:
D(2) dopamine receptor
Synonyms:
D(2) dopamine receptor DOPAMINE D2 Long DRD2 Dopamine D2 receptor Dopamine D2 receptor (D2R) Dopamine2-like | d2
Type:
Cell-surface receptors
Mol. Mass.:
50647.10
Organism:
Homo sapiens (Human)
Description:
P14416
Residue:
443
  
Inhibitor
Name:
BDBM50561093
Synonyms:
CHEMBL4784373
Type:
Small organic molecule
Emp. Form.:
C23H26FN3O3
Mol. Mass.:
411.4692
SMILES:
CC(=O)Nc1ccc(OCCCN2CCC(CC2)c2noc3cc(F)ccc23)cc1
: