Target
5-hydroxytryptamine receptor 1A
Ligand
BDBM152524
Substrate
Meas. Tech.
ChEMBL_2074245 (CHEMBL4729779)
Ki
1988±n/a nM
Citation
 Huang, LGao, LZhang, XYin, LHu, JSong, TChen, Y Synthesis and pharmacological evaluation of piperidine (piperazine)-amide substituted derivatives as multi-target antipsychotics. Bioorg Med Chem Lett 30:0 (2020)  
Target
Name:
5-hydroxytryptamine receptor 1A
Synonyms:
5-HT-1A 5-hydroxytryptamine receptor 1A (5-HT-1A) ADRB2RL1 Dopamine D2 receptor and serotonin 1a receptor HTR1A | Serotonin receptor 1A
Type:
Mol. Mass.:
46122.49
Organism:
Homo sapiens (Human)
Description:
Residue:
422
  
Inhibitor
Name:
BDBM152524
Synonyms:
N-(4-(3-(4-(pyridin-2-yl)piperazin-1-yl)propoxy)phenyl)acetamide (2f)
Type:
Small organic molecule
Emp. Form.:
C20H26N4O2
Mol. Mass.:
354.446
SMILES:
CC(=O)Nc1ccc(OCCCN2CCN(CC2)c2ccccn2)cc1
: