Target
5-hydroxytryptamine receptor 1A
Ligand
BDBM50561098
Substrate
Meas. Tech.
ChEMBL_2074245 (CHEMBL4729779)
Ki
122±n/a nM
Citation
 Huang, LGao, LZhang, XYin, LHu, JSong, TChen, Y Synthesis and pharmacological evaluation of piperidine (piperazine)-amide substituted derivatives as multi-target antipsychotics. Bioorg Med Chem Lett 30:0 (2020)  
Target
Name:
5-hydroxytryptamine receptor 1A
Synonyms:
5-HT-1A 5-hydroxytryptamine receptor 1A (5-HT-1A) ADRB2RL1 Dopamine D2 receptor and serotonin 1a receptor HTR1A | Serotonin receptor 1A
Type:
Mol. Mass.:
46122.49
Organism:
Homo sapiens (Human)
Description:
Residue:
422
  
Inhibitor
Name:
BDBM50561098
Synonyms:
CHEMBL4790699
Type:
Small organic molecule
Emp. Form.:
C23H25F2N3O3
Mol. Mass.:
429.4597
SMILES:
CC(=O)Nc1ccc(OCCCN2CCC(CC2)c2noc3cc(F)ccc23)cc1F
: