Target
5-hydroxytryptamine receptor 1A
Ligand
BDBM50561105
Substrate
Meas. Tech.
ChEMBL_2074245 (CHEMBL4729779)
Ki
156±n/a nM
Citation
 Huang, LGao, LZhang, XYin, LHu, JSong, TChen, Y Synthesis and pharmacological evaluation of piperidine (piperazine)-amide substituted derivatives as multi-target antipsychotics. Bioorg Med Chem Lett 30:0 (2020)  
Target
Name:
5-hydroxytryptamine receptor 1A
Synonyms:
5-HT-1A 5-hydroxytryptamine receptor 1A (5-HT-1A) ADRB2RL1 Dopamine D2 receptor and serotonin 1a receptor HTR1A | Serotonin receptor 1A
Type:
Mol. Mass.:
46122.49
Organism:
Homo sapiens (Human)
Description:
Residue:
422
  
Inhibitor
Name:
BDBM50561105
Synonyms:
CHEMBL4799934
Type:
Small organic molecule
Emp. Form.:
C23H26FN3O4
Mol. Mass.:
427.4686
SMILES:
CC(=O)Nc1ccc(OCC(O)CN2CCC(CC2)c2noc3cc(F)ccc23)cc1
: