Target
5-hydroxytryptamine receptor 2A
Ligand
BDBM50561090
Substrate
Meas. Tech.
ChEMBL_2074246 (CHEMBL4729780)
Ki
289±n/a nM
Citation
 Huang, LGao, LZhang, XYin, LHu, JSong, TChen, Y Synthesis and pharmacological evaluation of piperidine (piperazine)-amide substituted derivatives as multi-target antipsychotics. Bioorg Med Chem Lett 30:0 (2020)  
Target
Name:
5-hydroxytryptamine receptor 2A
Synonyms:
5-HT-2 5-HT2A 5-hydroxytryptamine receptor 2A (5HT-2A) 5HT2A_HUMAN HTR2A | Serotonin receptor 2A
Type:
undefined
Mol. Mass.:
52607.65
Organism:
Homo sapiens (Human)
Description:
P28223
Residue:
471
  
Inhibitor
Name:
BDBM50561090
Synonyms:
CHEMBL4779364
Type:
Small organic molecule
Emp. Form.:
C21H25Cl2N3O2
Mol. Mass.:
422.348
SMILES:
CC(=O)Nc1ccc(OCCCN2CCN(CC2)c2cccc(Cl)c2Cl)cc1
: