Target
5-hydroxytryptamine receptor 2C
Ligand
BDBM50561102
Substrate
Meas. Tech.
ChEMBL_2074250 (CHEMBL4729784)
Ki
186±n/a nM
Citation
 Huang, LGao, LZhang, XYin, LHu, JSong, TChen, Y Synthesis and pharmacological evaluation of piperidine (piperazine)-amide substituted derivatives as multi-target antipsychotics. Bioorg Med Chem Lett 30:0 (2020)  
Target
Name:
5-hydroxytryptamine receptor 2C
Synonyms:
5-HT-1C 5-HT1C 5-HT2C-INI 5-HTR2C 5-hydroxytryptamine receptor 2C (5-HT-2C) 5HT-1C HTR1C Serotonin (5-HT3) receptor Serotonin Receptor 2C
Type:
G Protein-Coupled Receptor (GPCR)
Mol. Mass.:
51836.79
Organism:
Homo sapiens (Human)
Description:
P28335
Residue:
458
  
Inhibitor
Name:
BDBM50561102
Synonyms:
CHEMBL4794963
Type:
Small organic molecule
Emp. Form.:
C24H28FN3O3
Mol. Mass.:
425.4958
SMILES:
CC(=O)Nc1ccc(OCCCCN2CCC(CC2)c2noc3cc(F)ccc23)cc1
: