Target
Succinate receptor 1
Ligand
BDBM50561203
Substrate
Meas. Tech.
ChEMBL_2074424 (CHEMBL4729958)
IC50
92±n/a nM
Citation
 Velcicky, JWilcken, RCotesta, SJanser, PSchlapbach, AWagner, TPiechon, PVillard, FBouhelal, RPiller, FHarlfinger, SStringer, RFehlmann, DKaupmann, KLittlewood-Evans, AHaffke, MGommermann, N Discovery and Optimization of Novel SUCNR1 Inhibitors: Design of Zwitterionic Derivatives with a Salt Bridge for the Improvement of Oral Exposure. J Med Chem 63:9856-9875 (2020)  
Target
Name:
Succinate receptor 1
Synonyms:
G-protein coupled receptor 91 P2Y purinoceptor 1-like SUCR1_HUMAN
Type:
PROTEIN
Mol. Mass.:
38709.48
Organism:
Homo sapiens (Human)
Description:
ChEMBL_852820
Residue:
334
  
Inhibitor
Name:
BDBM50561203
Synonyms:
CHEMBL4752851
Type:
Small organic molecule
Emp. Form.:
C26H23ClF2N2O4
Mol. Mass.:
500.922
SMILES:
OC(=O)Cc1cc(F)ccc1NC(=O)c1cccc(c1)-c1ccc(Cl)c(O[C@@H]2CCCNC2)c1F
: