Target
Bifunctional epoxide hydrolase 2
Ligand
BDBM50264106
Substrate
Meas. Tech.
ChEMBL_2074989 (CHEMBL4730523)
IC50
0.700000±n/a nM
Citation
 Hiesinger, KKramer, JSBeyer, SEckes, TBrunst, SFlauaus, CWittmann, SKWeizel, LKaiser, AKretschmer, SBMGeorge, SAngioni, CHeering, JGeisslinger, GSchubert-Zsilavecz, MSchmidtko, APogoryelov, DPfeilschifter, JHofmann, BSteinhilber, DSchwalm, SProschak, E Design, Synthesis, and Structure-Activity Relationship Studies of Dual Inhibitors of Soluble Epoxide Hydrolase and 5-Lipoxygenase. J Med Chem 63:11498-11521 (2020)  
Target
Name:
Bifunctional epoxide hydrolase 2
Synonyms:
Cytosolic epoxide hydrolase 2 EPHX2 HYES_HUMAN Soluble epoxide hydrolase (sEH) | epoxide hydrolase 2, cytoplasmic
Type:
Enzyme
Mol. Mass.:
62613.07
Organism:
Homo sapiens (Human)
Description:
P34913
Residue:
555
  
Inhibitor
Name:
BDBM50264106
Synonyms:
CHEMBL3818875
Type:
Small organic molecule
Emp. Form.:
C21H24F3N7O
Mol. Mass.:
447.4568
SMILES:
CNc1nc(C)nc(N[C@H]2CCC[C@H](C2)C(=O)NCc2ccc(cc2C(F)(F)F)C#N)n1
: