Target
Bifunctional epoxide hydrolase 2
Ligand
BDBM50561483
Substrate
Meas. Tech.
ChEMBL_2074989 (CHEMBL4730523)
IC50
2.0±n/a nM
Citation
 Hiesinger, KKramer, JSBeyer, SEckes, TBrunst, SFlauaus, CWittmann, SKWeizel, LKaiser, AKretschmer, SBMGeorge, SAngioni, CHeering, JGeisslinger, GSchubert-Zsilavecz, MSchmidtko, APogoryelov, DPfeilschifter, JHofmann, BSteinhilber, DSchwalm, SProschak, E Design, Synthesis, and Structure-Activity Relationship Studies of Dual Inhibitors of Soluble Epoxide Hydrolase and 5-Lipoxygenase. J Med Chem 63:11498-11521 (2020)  
Target
Name:
Bifunctional epoxide hydrolase 2
Synonyms:
Cytosolic epoxide hydrolase 2 EPHX2 HYES_HUMAN Soluble epoxide hydrolase (sEH) | epoxide hydrolase 2, cytoplasmic
Type:
Enzyme
Mol. Mass.:
62613.07
Organism:
Homo sapiens (Human)
Description:
P34913
Residue:
555
  
Inhibitor
Name:
BDBM50561483
Synonyms:
CHEMBL4795110
Type:
Small organic molecule
Emp. Form.:
C27H26FN3O3
Mol. Mass.:
459.512
SMILES:
CC(C#Cc1cccc(c1)C(=O)NCCC(c1ccccc1)c1ccc(F)cc1)N(O)C(N)=O
: