Target
4-aminobutyrate aminotransferase, mitochondrial
Ligand
BDBM50085233
Substrate
Meas. Tech.
ChEMBL_2075518 (CHEMBL4731052)
Ki
53000±n/a nM
Citation
 Shen, SDoubleday, PFWeerawarna, PMZhu, WKelleher, NLSilverman, RB Mechanism-Based Design of 3-Amino-4-Halocyclopentenecarboxylic Acids as Inactivators of GABA Aminotransferase. ACS Med Chem Lett 11:1949-1955 (2020)  
Target
Name:
4-aminobutyrate aminotransferase, mitochondrial
Synonyms:
(S)-3-amino-2-methylpropionate transaminase 2.6.1.22 ABAT GABA transaminase GABA-T GABT_PIG L-AIBAT
Type:
Mol. Mass.:
56633.06
Organism:
Sus scrofa
Description:
Residue:
500
  
Inhibitor
Name:
BDBM50085233
Synonyms:
3-Amino-4-fluoro-cyclopentanecarboxylic acid | CHEMBL163117
Type:
Small organic molecule
Emp. Form.:
C6H10FNO2
Mol. Mass.:
147.1475
SMILES:
N[C@H]1C[C@H](C[C@@H]1F)C(O)=O
: