Target
Orexin/Hypocretin receptor type 1
Ligand
BDBM50561648
Substrate
Meas. Tech.
ChEMBL_2075629 (CHEMBL4731163)
Ki
25±n/a nM
Citation
 Préville, CBonaventure, PKoudriakova, TLord, BNepomuceno, DRizzolio, MMani, NCoe, KJNdifor, ADugovic, CDvorak, CACoate, HPippel, DJFitzgerald, AAllison, BLovenberg, TWCarruthers, NIShireman, BT Substituted Azabicyclo[2.2.1]heptanes as Selective Orexin-1 Antagonists: Discovery of JNJ-54717793. ACS Med Chem Lett 11:2002-2009 (2020)  
Target
Name:
Orexin/Hypocretin receptor type 1
Synonyms:
HCRTR1 OX1R_HUMAN Orexin receptor type 1 (OR 1) Orexin receptor type 1 (OX1) Orexin receptor type 1 (OxR1) | Ox1r
Type:
Protein
Mol. Mass.:
47554.50
Organism:
Homo sapiens (Human)
Description:
O43613
Residue:
425
  
Inhibitor
Name:
BDBM50561648
Synonyms:
CHEMBL4743991
Type:
Small organic molecule
Emp. Form.:
C22H18F4N6O
Mol. Mass.:
458.4115
SMILES:
[H][C@@]12CC[C@@]([H])([C@@H](C1)Nc1cnc(cn1)C(F)(F)F)N2C(=O)c1c(F)cccc1-c1ncccn1
: