Target
Orexin receptor type 2
Ligand
BDBM163901
Substrate
Meas. Tech.
ChEMBL_2075630 (CHEMBL4731164)
Ki
160±n/a nM
Citation
 Préville, CBonaventure, PKoudriakova, TLord, BNepomuceno, DRizzolio, MMani, NCoe, KJNdifor, ADugovic, CDvorak, CACoate, HPippel, DJFitzgerald, AAllison, BLovenberg, TWCarruthers, NIShireman, BT Substituted Azabicyclo[2.2.1]heptanes as Selective Orexin-1 Antagonists: Discovery of JNJ-54717793. ACS Med Chem Lett 11:2002-2009 (2020)  
Target
Name:
Orexin receptor type 2
Synonyms:
HCRTR2 OX2R_HUMAN Orexin receptor type 2 (OR-2) Orexin receptor type 2 (OX2R) Ox-2-R | Ox2-R
Type:
Protein
Mol. Mass.:
50710.53
Organism:
Homo sapiens (Human)
Description:
O43614
Residue:
444
  
Inhibitor
Name:
BDBM163901
Synonyms:
US9062078, 32 US9637496, 32 | US9695183, 32
Type:
Small organic molecule
Emp. Form.:
C23H20F2N4O2
Mol. Mass.:
422.4273
SMILES:
Fc1ccc(OCC2CC3CCC2N3C(=O)c2cc(F)ccc2-c2ncccn2)nc1
: