Target
Orexin receptor type 2
Ligand
BDBM4532
Substrate
Meas. Tech.
ChEMBL_2075630 (CHEMBL4731164)
Ki
230±n/a nM
Citation
 Préville, CBonaventure, PKoudriakova, TLord, BNepomuceno, DRizzolio, MMani, NCoe, KJNdifor, ADugovic, CDvorak, CACoate, HPippel, DJFitzgerald, AAllison, BLovenberg, TWCarruthers, NIShireman, BT Substituted Azabicyclo[2.2.1]heptanes as Selective Orexin-1 Antagonists: Discovery of JNJ-54717793. ACS Med Chem Lett 11:2002-2009 (2020)  
Target
Name:
Orexin receptor type 2
Synonyms:
HCRTR2 OX2R_HUMAN Orexin receptor type 2 (OR-2) Orexin receptor type 2 (OX2R) Ox-2-R | Ox2-R
Type:
Protein
Mol. Mass.:
50710.53
Organism:
Homo sapiens (Human)
Description:
O43614
Residue:
444
  
Inhibitor
Name:
BDBM4532
Synonyms:
US9475819, 3B
Type:
Emp. Form.:
C23H23N5O2
Mol. Mass.:
401.461
SMILES:
Cc1ccc(-c2ncccn2)c(n1)C(=O)N1[C@@H]2CC[C@H]1[C@H](COc1ccccn1)C2
: