Target
Orexin receptor type 2
Ligand
BDBM50561647
Substrate
Meas. Tech.
ChEMBL_2075630 (CHEMBL4731164)
Ki
520±n/a nM
Citation
 Préville, CBonaventure, PKoudriakova, TLord, BNepomuceno, DRizzolio, MMani, NCoe, KJNdifor, ADugovic, CDvorak, CACoate, HPippel, DJFitzgerald, AAllison, BLovenberg, TWCarruthers, NIShireman, BT Substituted Azabicyclo[2.2.1]heptanes as Selective Orexin-1 Antagonists: Discovery of JNJ-54717793. ACS Med Chem Lett 11:2002-2009 (2020)  
Target
Name:
Orexin receptor type 2
Synonyms:
HCRTR2 OX2R_HUMAN Orexin receptor type 2 (OR-2) Orexin receptor type 2 (OX2R) Ox-2-R | Ox2-R
Type:
Protein
Mol. Mass.:
50710.53
Organism:
Homo sapiens (Human)
Description:
O43614
Residue:
444
  
Inhibitor
Name:
BDBM50561647
Synonyms:
CHEMBL4750440
Type:
Small organic molecule
Emp. Form.:
C22H19F3N6O
Mol. Mass.:
440.4211
SMILES:
[H][C@@]12CC[C@@]([H])([C@@H](C1)Nc1cnc(cn1)C(F)(F)F)N2C(=O)c1ccccc1-c1ncccn1
: