Target
Kinesin-like protein KIF18A
Ligand
BDBM50561745
Substrate
Meas. Tech.
ChEMBL_2075814 (CHEMBL4731348)
IC50
12±n/a nM
Citation
 Sabnis, RW Novel KIF18A Inhibitors for Treating Cancer. ACS Med Chem Lett 11:2079-2080 (2020)  
Target
Name:
Kinesin-like protein KIF18A
Synonyms:
KI18A_HUMAN Kinesin-like protein KIF18A Marrow stromal KIF18A
Type:
PROTEIN
Mol. Mass.:
102320.22
Organism:
Homo sapiens
Description:
ChEMBL_119153
Residue:
898
  
Inhibitor
Name:
BDBM50561745
Synonyms:
CHEMBL4784192
Type:
Small organic molecule
Emp. Form.:
C26H35N5O5S
Mol. Mass.:
529.652
SMILES:
Cc1ccc(NC(=O)c2ccc(NS(=O)(=O)CCO)cc2N2CCC3(CC3)CC2)nc1N1CCOCC1
: