Target
Androgen receptor
Ligand
BDBM50124600
Substrate
Meas. Tech.
ChEBML_210239
Ki
>5000±n/a nM
Citation
 Kym, PRKort, MECoghlan, MJMoore, JLTang, RRatajczyk, JDLarson, DPElmore, SWPratt, JKStashko, MAFalls, HDLin, CWNakane, MMiller, LTyree, CMMiner, JNJacobson, PBWilcox, DMNguyen, PLane, BC Nonsteroidal selective glucocorticoid modulators: the effect of C-10 substitution on receptor selectivity and functional potency of 5-allyl-2,5-dihydro-2,2,4-trimethyl-1H-[1]benzopyrano[3,4-f]quinolines. J Med Chem 46:1016-30 (2003)  
Target
Name:
Androgen receptor
Synonyms:
ANDR_HUMAN Androgen Receptor Androgen receptor/Baculoviral IAP repeat-containing protein 2 Dihydrotestosterone receptor Nuclear receptor subfamily 3 group C member 4
Type:
Receptor
Mol. Mass.:
99185.27
Organism:
Homo sapiens (Human)
Description:
CHO cells were stably transfected with human AR gene.
Residue:
920
  
Inhibitor
Name:
BDBM50124600
Synonyms:
5-Allyl-2,2,4-trimethyl-2,5-dihydro-1H-6-oxa-1-aza-chrysene-10-carbonitrile | CHEMBL8209
Type:
Small organic molecule
Emp. Form.:
C23H22N2O
Mol. Mass.:
342.4336
SMILES:
CC1=CC(C)(C)Nc2ccc-3c(C(CC=C)Oc4cccc(C#N)c-34)c12
: