Target
Glutamate receptor ionotropic, NMDA 2B
Ligand
BDBM50124885
Substrate
Meas. Tech.
ChEMBL_141156 (CHEMBL749674)
Kd
1±n/a nM
Citation
 Claiborne, CFMcCauley, JALibby, BECurtis, NRDiggle, HJKulagowski, JJMichelson, SRAnderson, KDClaremon, DAFreidinger, RMBednar, RAMosser, SDGaul, SLConnolly, TMCondra, CLBednar, BStump, GLLynch, JJMacaulay, AWafford, KAKoblan, KSLiverton, NJ Orally efficacious NR2B-selective NMDA receptor antagonists. Bioorg Med Chem Lett 13:697-700 (2003)  
Target
Name:
Glutamate receptor ionotropic, NMDA 2B
Synonyms:
GRIN2B Glutamate [NMDA] receptor subunit epsilon 2 N-methyl D-aspartate receptor subtype 2B NMDAR2B NR3 | hNR3
Type:
PROTEIN
Mol. Mass.:
166375.46
Organism:
Homo sapiens (Human)
Description:
ChEMBL_1438829
Residue:
1484
  
Inhibitor
Name:
BDBM50124885
Synonyms:
(E)-N-(2-Methoxy-benzyl)-3-phenyl-acrylamidine N-(2-methoxybenzyl)cinnamamidine
Type:
Small organic molecule
Emp. Form.:
C17H18N2O
Mol. Mass.:
266.3376
SMILES:
COc1ccccc1CN=C(N)C=Cc1ccccc1
: