Target
Glutamate receptor ionotropic, NMDA 2B
Ligand
BDBM50124912
Substrate
Meas. Tech.
ChEMBL_141036 (CHEMBL749390)
IC50
450±n/a nM
Citation
 Claiborne, CFMcCauley, JALibby, BECurtis, NRDiggle, HJKulagowski, JJMichelson, SRAnderson, KDClaremon, DAFreidinger, RMBednar, RAMosser, SDGaul, SLConnolly, TMCondra, CLBednar, BStump, GLLynch, JJMacaulay, AWafford, KAKoblan, KSLiverton, NJ Orally efficacious NR2B-selective NMDA receptor antagonists. Bioorg Med Chem Lett 13:697-700 (2003)  
Target
Name:
Glutamate receptor ionotropic, NMDA 2B
Synonyms:
GRIN2B Glutamate [NMDA] receptor subunit epsilon 2 N-methyl D-aspartate receptor subtype 2B NMDAR2B NR3 | hNR3
Type:
PROTEIN
Mol. Mass.:
166375.46
Organism:
Homo sapiens (Human)
Description:
ChEMBL_1438829
Residue:
1484
  
Inhibitor
Name:
BDBM50124912
Synonyms:
CHEMBL159879 | N-(3-Chloro-benzyl)-4-fluoro-benzamidine
Type:
Small organic molecule
Emp. Form.:
C14H12ClFN2
Mol. Mass.:
262.71
SMILES:
NC(=NCc1cccc(Cl)c1)c1ccc(F)cc1
: