Target
Glutamate receptor ionotropic, NMDA 2B
Ligand
BDBM50124919
Substrate
Meas. Tech.
ChEMBL_141036 (CHEMBL749390)
IC50
110±n/a nM
Citation
 Claiborne, CFMcCauley, JALibby, BECurtis, NRDiggle, HJKulagowski, JJMichelson, SRAnderson, KDClaremon, DAFreidinger, RMBednar, RAMosser, SDGaul, SLConnolly, TMCondra, CLBednar, BStump, GLLynch, JJMacaulay, AWafford, KAKoblan, KSLiverton, NJ Orally efficacious NR2B-selective NMDA receptor antagonists. Bioorg Med Chem Lett 13:697-700 (2003)  
Target
Name:
Glutamate receptor ionotropic, NMDA 2B
Synonyms:
GRIN2B Glutamate [NMDA] receptor subunit epsilon 2 N-methyl D-aspartate receptor subtype 2B NMDAR2B NR3 | hNR3
Type:
PROTEIN
Mol. Mass.:
166375.46
Organism:
Homo sapiens (Human)
Description:
ChEMBL_1438829
Residue:
1484
  
Inhibitor
Name:
BDBM50124919
Synonyms:
3,4-Dichloro-N-(3-chloro-benzyl)-benzamidine | CHEMBL159818
Type:
Small organic molecule
Emp. Form.:
C14H11Cl3N2
Mol. Mass.:
313.61
SMILES:
NC(=NCc1cccc(Cl)c1)c1ccc(Cl)c(Cl)c1
: