Target
Glutamate receptor ionotropic, NMDA 2A
Ligand
BDBM50124918
Substrate
Meas. Tech.
ChEBML_141035
IC50
>10000±n/a nM
Citation
 Claiborne, CFMcCauley, JALibby, BECurtis, NRDiggle, HJKulagowski, JJMichelson, SRAnderson, KDClaremon, DAFreidinger, RMBednar, RAMosser, SDGaul, SLConnolly, TMCondra, CLBednar, BStump, GLLynch, JJMacaulay, AWafford, KAKoblan, KSLiverton, NJ Orally efficacious NR2B-selective NMDA receptor antagonists. Bioorg Med Chem Lett 13:697-700 (2003)  
Target
Name:
Glutamate receptor ionotropic, NMDA 2A
Synonyms:
GRIN2A Glutamate [NMDA] receptor Glutamate [NMDA] receptor subunit epsilon-1 NMDA receptor subtype 2A protein (NR2A) NMDE1_HUMAN hNR2A
Type:
Mol. Mass.:
165293.76
Organism:
Homo sapiens (Human)
Description:
Residue:
1464
  
Inhibitor
Name:
BDBM50124918
Synonyms:
3,4-Dichloro-N-(2-trifluoromethoxy-benzyl)-benzamidine | CHEMBL161876
Type:
Small organic molecule
Emp. Form.:
C15H11Cl2F3N2O
Mol. Mass.:
363.162
SMILES:
NC(=NCc1ccccc1OC(F)(F)F)c1ccc(Cl)c(Cl)c1
: