Target
D(4) dopamine receptor
Ligand
BDBM50092053
Substrate
Meas. Tech.
ChEBML_60995
Ki
1.6±n/a nM
Citation
 Zhao, HZhang, XHodgetts, KThurkauf, AHammer, JChandrasekhar, JKieltyka, ABrodbeck, RRachwal, SPrimus, RManly, C Design, synthesis, and discovery of 5-piperazinyl-1,2,6,7-tetrahydro-5H-azepino[3,2,1-hi]indol-4-one derivatives: a novel series of mixed dopamine D2/D4 receptor antagonist. Bioorg Med Chem Lett 13:701-4 (2003)  
Target
Name:
D(4) dopamine receptor
Synonyms:
D(2C) dopamine receptor DOPAMINE D4.2 DRD4 Dopamine D4 receptor
Type:
Enzyme
Mol. Mass.:
48373.19
Organism:
Homo sapiens (Human)
Description:
P21917
Residue:
419
  
Inhibitor
Name:
BDBM50092053
Synonyms:
2-[4-(4-Chloro-benzyl)-piperazin-1-yl]-1-(2,3-dihydro-indol-1-yl)-ethanone | CHEMBL69584
Type:
Small organic molecule
Emp. Form.:
C21H24ClN3O
Mol. Mass.:
369.888
SMILES:
Clc1ccc(CN2CCN(CC(=O)N3CCc4ccccc34)CC2)cc1
: