Target
5'-nucleotidase
Ligand
BDBM50561934
Substrate
Meas. Tech.
ChEMBL_2076335 (CHEMBL4731869)
IC50
680±n/a nM
Citation
 Ashraf, AShafiq, ZKhan Jadoon, MSTahir, MNPelletier, JSevigny, JYaqub, MIqbal, J Synthesis, Characterization, and  ACS Med Chem Lett 11:2397-2405 (2020)  
Target
Name:
5'-nucleotidase
Synonyms:
5'-nucleotidase Ecto-5'-nucleotidase (e5'NT) NT Nt5e | Nte
Type:
Enzyme
Mol. Mass.:
63971.44
Organism:
Rattus norvegicus (Rat)
Description:
P21588
Residue:
576
  
Inhibitor
Name:
BDBM50561934
Synonyms:
CHEMBL4753669
Type:
Small organic molecule
Emp. Form.:
C15H11ClN6O
Mol. Mass.:
326.74
SMILES:
CN1C(=O)C2(c3c[nH]nc3NC(N)=C2C#N)c2cc(Cl)ccc12
: