Target
5'-nucleotidase
Ligand
BDBM50561937
Substrate
Meas. Tech.
ChEMBL_2076335 (CHEMBL4731869)
IC50
1560±n/a nM
Citation
 Ashraf, AShafiq, ZKhan Jadoon, MSTahir, MNPelletier, JSevigny, JYaqub, MIqbal, J Synthesis, Characterization, and  ACS Med Chem Lett 11:2397-2405 (2020)  
Target
Name:
5'-nucleotidase
Synonyms:
5'-nucleotidase Ecto-5'-nucleotidase (e5'NT) NT Nt5e | Nte
Type:
Enzyme
Mol. Mass.:
63971.44
Organism:
Rattus norvegicus (Rat)
Description:
P21588
Residue:
576
  
Inhibitor
Name:
BDBM50561937
Synonyms:
CHEMBL4780721
Type:
Small organic molecule
Emp. Form.:
C16H13ClN6O
Mol. Mass.:
340.767
SMILES:
CN1C(=O)C2(c3cc(Cl)ccc13)c1c(C)[nH]nc1NC(N)=C2C#N
: