Target
Acetyl-CoA carboxylase 1
Ligand
BDBM50562555
Substrate
Meas. Tech.
ChEMBL_2079230 (CHEMBL4735021)
IC50
2.2±n/a nM
Citation
 Huang, TWu, XYan, SLiu, TYin, X Synthesis and in vitro evaluation of novel spiroketopyrazoles as acetyl-CoA carboxylase inhibitors and potential antitumor agents. Eur J Med Chem 212:0 (2021)  
Target
Name:
Acetyl-CoA carboxylase 1
Synonyms:
ACAC ACACA_HUMAN ACC1 Acetyl-CoA carboxylase 1 | Acetyl-CoA carboxylase 1 (ACC1)
Type:
Protein
Mol. Mass.:
265543.22
Organism:
Homo sapiens (Human)
Description:
Q13085
Residue:
2346
  
Inhibitor
Name:
BDBM50562555
Synonyms:
CHEMBL4792495
Type:
Small organic molecule
Emp. Form.:
C31H32N4O3
Mol. Mass.:
508.6108
SMILES:
Cc1ccc(cc1)-c1cc(C(=O)N2CCC3(CC2)CC(=O)c2nn(cc2O3)C(C)(C)C)c2ccccc2n1
: